{"text_format":"1","workbook":"xlsx","n_sheets":2,"sheets":["■会社法人■","登録免許税"],"not_rendered":{"charts":0,"images":0,"macros":1,"external_links":0,"defined_names":0,"comments":0,"pivot_tables":0},"unopened":[],"bounds":{"document_bytes":16777216,"sheet_cells":100000,"rows_first":2000,"rows_last":500,"rows_between":2000,"halvings":0,"cell_chars":16384,"cell_head_chars":4096},"cells_cut":0,"cells_raw":0,"read":"whole","date_system":"1900"}

{"sheet":"■会社法人■","index":0,"n_rows":5,"n_cols":7,"rows_kept":5,"cut":false,"hidden":false,"merged":[[20,4,20,5]]}
["項目","見出し符号","課税標準","税率・税額","基準額","税額・実費","報酬単価"]
["イ　株式会社の設立の登記（ホ及びトに掲げる登記を除く。）",{"$f":"IF(A2=\"\",\"\",VLOOKUP(A2,登録免許税!C1:G108,2,0))","v":"24/1/イ"},{"$f":"IF(A2=\"\",\"\",VLOOKUP(A2,登録免許税!C2:G108,3,0))","v":"資本金の額"},{"$f":"IF(A2=\"\",\"\",VLOOKUP(A2,登録免許税!C2:G108,4,0))","v":"1000/7"},{"$f":"IF(A2=\"\",\"\",VLOOKUP(A2,登録免許税!C2:G108,5,0))","v":"（これによつて計算した税額が150000に満たないときは、150000）"}]
["ツ　登記事項の変更、消滅又は廃止の登記（これらの登記のうちイからソまでに掲げるものを除く。）",{"$f":"IF(A3=\"\",\"\",VLOOKUP(A3,登録免許税!C1:G108,2,0))","v":"24/1/ツ"},{"$f":"IF(A3=\"\",\"\",VLOOKUP(A3,登録免許税!C1:G108,3,0))","v":"申請件数"},{"$f":"IF(A3=\"\",\"\",VLOOKUP(A3,登録免許税!C1:G108,4,0))","v":30000},{"$f":"IF(A3=\"\",\"\",VLOOKUP(A3,登録免許税!C1:G108,5,0))","v":"一件につき"}]
["ネ　登記の更正の登記",{"$f":"IF(A4=\"\",\"\",VLOOKUP(A4,登録免許税!C1:G108,2,0))","v":"24/1/ネ"},{"$f":"IF(A4=\"\",\"\",VLOOKUP(A4,登録免許税!C1:G108,3,0))","v":"申請件数"},{"$f":"IF(A4=\"\",\"\",VLOOKUP(A4,登録免許税!C1:G108,4,0))","v":20000},{"$f":"IF(A4=\"\",\"\",VLOOKUP(A4,登録免許税!C1:G108,5,0))","v":0}]
["ニ　株式会社又は合同会社の資本金の増加の登記（ヘ及びチに掲げる登記を除く。）",{"$f":"IF(A5=\"\",\"\",VLOOKUP(A5,登録免許税!C1:G108,2,0))","v":"24/1/ニ"},{"$f":"IF(A5=\"\",\"\",VLOOKUP(A5,登録免許税!C1:G108,3,0))","v":"増加した資本金の額"},{"$f":"IF(A5=\"\",\"\",VLOOKUP(A5,登録免許税!C1:G108,4,0))","v":"1000/7"},{"$f":"IF(A5=\"\",\"\",VLOOKUP(A5,登録免許税!C1:G108,5,0))","v":"（これによつて計算した税額が30000に満たないときは、30000）"}]

{"sheet":"登録免許税","index":1,"n_rows":287,"n_cols":7,"rows_kept":287,"cut":false,"hidden":false,"merged":[]}
["Sentence","半角英数","登記、登録、特許、免許、許可、認可、認定、指定又は技能証明の事項","見出し符号","課税標準","税率・税額","基準額"]
["二十四　会社又は外国会社の商業登記（保険業法の規定によつてする相互会社及び外国相互会社の登記並びに一般社団法人及び一般財団法人に関する法律（平成十八年法律第四十八号）の規定によつてする一般社団法人（公益社団法人を除く。以下この号において同じ。）及び一般財団法人（公益財団法人を除く。以下この号において同じ。）の登記を含む。）","204　会社又は外国会社の商業登記（保険業法の規定によつてする相互会社及び外国相互会社の登記並びに1般社団法人及び1般財団法人に関する法律（平成08年法律第408号）の規定によつてする1般社団法人（公益社団法人を除く。以下この号において同じ。）及び1般財団法人（公益財団法人を除く。以下この号において同じ。）の登記を含む。）","（1）　会社又は相互会社若しくは1般社団法人若しくは1般財団法人（以下この号において「1般社団法人等」という。）につきその本店又は主たる事務所の所在地においてする登記（（4）に掲げる登記を除く。）","24/1"]
["（一）　会社又は相互会社若しくは一般社団法人若しくは一般財団法人（以下この号において「一般社団法人等」という。）につきその本店又は主たる事務所の所在地においてする登記（（四）に掲げる登記を除く。）","（1）　会社又は相互会社若しくは1般社団法人若しくは1般財団法人（以下この号において「1般社団法人等」という。）につきその本店又は主たる事務所の所在地においてする登記（（4）に掲げる登記を除く。）","イ　株式会社の設立の登記（ホ及びトに掲げる登記を除く。）","24/1/イ","資本金の額","1000/7","（これによつて計算した税額が150000に満たないときは、150000）"]
["イ　株式会社の設立の登記（ホ及びトに掲げる登記を除く。）","イ　株式会社の設立の登記（ホ及びトに掲げる登記を除く。）","ロ　合名会社若しくは合資会社又は1般社団法人等の設立の登記","24/1/ロ","申請件数",60000]
["資本金の額","資本金の額","ハ　合同会社の設立の登記（ホ及びトに掲げる登記を除く。）","24/1/ハ","資本金の額","1000/7","（これによつて計算した税額が60000に満たないときは、60000）"]
["千分の七","1000/7","ニ　株式会社又は合同会社の資本金の増加の登記（ヘ及びチに掲げる登記を除く。）","24/1/ニ","増加した資本金の額","1000/7","（これによつて計算した税額が30000に満たないときは、30000）"]
["（これによつて計算した税額が十五万円に満たないときは、申請件数一件につき十五万円）","（これによつて計算した税額が150000に満たないときは、申請件数150000）","ホ　新設合併又は組織変更若しくは種類の変更による株式会社又は合同会社の設立の登記","24/1/ホ","資本金の額（新設合併により消滅した会社又は組織変更若しくは種類の変更をした会社の当該新設合併又は組織変更若しくは種類の変更の直前における資本金の額として財務省令で定めるものを超える資本金の額に対応する部分については、1000/7）","1000/1.5"]
["ロ　合名会社若しくは合資会社又は一般社団法人等の設立の登記","ロ　合名会社若しくは合資会社又は1般社団法人等の設立の登記","ヘ　吸収合併による株式会社又は合同会社の資本金の増加の登記","24/1/ヘ","増加した資本金の額（吸収合併により消滅した会社の当該吸収合併の直前における資本金の額として財務省令で定めるものを超える資本金の額に対応する部分については、1000/7）","1000/1.5","（これによつて計算した税額が30000に満たないときは、申請件数30000）"]
["申請件数","申請件数","ト　新設分割による株式会社又は合同会社の設立の登記","24/1/ト","資本金の額","1000/7","（これによつて計算した税額が30000に満たないときは、30000）"]
["一件につき六万円",60000,"チ　吸収分割による株式会社又は合同会社の資本金の増加の登記","24/1/チ","増加した資本金の額","1000/7","（これによつて計算した税額が30000に満たないときは、30000）"]
["ハ　合同会社の設立の登記（ホ及びトに掲げる登記を除く。）","ハ　合同会社の設立の登記（ホ及びトに掲げる登記を除く。）","リ　相互会社の設立（新設合併又は組織変更による設立を含む。）の登記","24/1/リ","申請件数",300000]
["資本金の額","資本金の額","ヌ　新株予約権の発行による変更の登記","24/1/ヌ","申請件数",90000]
["千分の七","1000/7","ル　支店又は従たる事務所の設置の登記","24/1/ル","支店又は従たる事務所の数1箇所につき",60000]
["（これによつて計算した税額が六万円に満たないときは、申請件数一件につき六万円）","（これによつて計算した税額が60000に満たないときは、申請件数60000）","ワ　取締役会、監査役会、監査等委員会若しくは指名委員会等（会社法第2条第02号（定義）に規定する指名委員会等をいう。以下（1）において同じ。）又は理事会に関する事項の変更の登記","24/1/ワ","本店若しくは主たる事務所又は支店若しくは従たる事務所の数1箇所につき",30000,"一件につき"]
["ニ　株式会社又は合同会社の資本金の増加の登記（ヘ及びチに掲げる登記を除く。）","ニ　株式会社又は合同会社の資本金の増加の登記（ヘ及びチに掲げる登記を除く。）","カ　取締役、代表取締役若しくは特別取締役、会計参与、監査役、会計監査人、指名委員会等の委員、執行役若しくは代表執行役若しくは社員又は理事、監事、代表理事若しくは評議員に関する事項の変更（会社又は相互会社若しくは1般社団法人等の代表に関する事項の変更を含む。）の登記","24/1/カ","申請件数",30000,"（資本金の額が1億以下の会社又は1般社団法人等については、10000）"]
["増加した資本金の額","増加した資本金の額","ヨ　支配人の選任の登記又はその代理権の消滅の登記","24/1/ヨ","申請件数",30000]
["千分の七","1000/7","タ　取締役、代表取締役若しくは特別取締役、会計参与、監査役若しくは指名委員会等の委員、執行役若しくは代表執行役の職務執行の停止若しくは職務代行者の選任、社員の業務執行権の消滅、職務執行の停止若しくは職務代行者の選任又は理事、監事、代表理事若しくは評議員の職務執行の停止若しくは職務代行者の選任の登記","24/1/タ","申請件数",30000]
["（これによつて計算した税額が三万円に満たないときは、申請件数一件につき三万円）","（これによつて計算した税額が30000に満たないときは、申請件数30000）","レ　会社又は相互会社若しくは1般社団法人等の解散の登記","24/1/ﾊ","申請件数",30000]
["ホ　新設合併又は組織変更若しくは種類の変更による株式会社又は合同会社の設立の登記","ホ　新設合併又は組織変更若しくは種類の変更による株式会社又は合同会社の設立の登記","ソ　会社若しくは1般社団法人等の継続の登記、合併を無効とする判決が確定した場合における合併により消滅した会社若しくは相互会社若しくは1般社団法人等の回復の登記又は会社若しくは相互会社若しくは1般社団法人等の設立の無効若しくはその設立の取消しの登記","24/1/レ","申請件数",30000]
["資本金の額","資本金の額","ツ　登記事項の変更、消滅又は廃止の登記（これらの登記のうちイからソまでに掲げるものを除く。）","24/1/ツ","申請件数",30000,"一件につき"]
["千分の一・五（新設合併により消滅した会社又は組織変更若しくは種類の変更をした会社の当該新設合併又は組織変更若しくは種類の変更の直前における資本金の額として財務省令で定めるものを超える資本金の額に対応する部分については、千分の七）","1000/1.5（新設合併により消滅した会社又は組織変更若しくは種類の変更をした会社の当該新設合併又は組織変更若しくは種類の変更の直前における資本金の額として財務省令で定めるものを超える資本金の額に対応する部分については、1000/7）","ネ　登記の更正の登記","24/1/ネ","申請件数",20000]
["（これによつて計算した税額が三万円に満たないときは、申請件数一件につき三万円）","（これによつて計算した税額が30000に満たないときは、申請件数30000）","ナ　登記の抹消","24/1/ナ","申請件数",20000]
["ヘ　吸収合併による株式会社又は合同会社の資本金の増加の登記","ヘ　吸収合併による株式会社又は合同会社の資本金の増加の登記","（2）　会社又は相互会社若しくは1般社団法人等につきその支店又は従たる事務所の所在地においてする登記（（4）に掲げる登記を除く。）","24/2"]
["増加した資本金の額","増加した資本金の額","イ　（1）イからツまでに掲げる登記","24/2/イ","申請件数",9000,"（申請に係る登記が、（1）カに掲げる登記に該当するもののみであり、かつ、資本金の額が1億以下の会社又は1般社団法人等の申請に係るものである場合には、6000）"]
["千分の一・五（吸収合併により消滅した会社の当該吸収合併の直前における資本金の額として財務省令で定めるものを超える資本金の額に対応する部分については、千分の七）","1000/1.5（吸収合併により消滅した会社の当該吸収合併の直前における資本金の額として財務省令で定めるものを超える資本金の額に対応する部分については、1000/7）","ロ　登記の更正の登記又は登記の抹消","24/2/ロ","申請件数",6000]
["（これによつて計算した税額が三万円に満たないときは、申請件数一件につき三万円）","（これによつて計算した税額が30000に満たないときは、申請件数30000）","（3）　外国会社又は外国相互会社につきその営業所の所在地又はその代表者の住所地においてする登記（（4）に掲げる登記を除く。）","24/3"]
["ト　新設分割による株式会社又は合同会社の設立の登記","ト　新設分割による株式会社又は合同会社の設立の登記","イ　営業所の設置の登記（ロに掲げる登記を除く。）","24/3/イ","1箇所につき",90000]
["資本金の額","資本金の額","ロ　営業所を設置していない場合の外国会社の登記又は当該営業所を設置していない外国会社が初めて設置する1の営業所の設置の登記","24/3/ロ","申請件数",60000]
["千分の七","1000/7","ハ　イ、ロ及びニに掲げる登記以外の登記","24/3/ハ","申請件数",9000]
["（これによつて計算した税額が三万円に満たないときは、申請件数一件につき三万円）","（これによつて計算した税額が30000に満たないときは、申請件数30000）","ニ　登記の更正の登記又は登記の抹消","24/3/ニ","申請件数",6000]
["チ　吸収分割による株式会社又は合同会社の資本金の増加の登記","チ　吸収分割による株式会社又は合同会社の資本金の増加の登記","（4）　会社又は相互会社若しくは1般社団法人等につきその本店若しくは主たる事務所又は支店若しくは従たる事務所の所在地においてする清算に係る登記（外国会社又は外国相互会社につきその営業所の所在地又はその代表者の住所地においてする清算に係る登記を含む。）","24/4"]
["増加した資本金の額","増加した資本金の額","イ　清算人又は代表清算人の登記","24/4/イ","申請件数",9000]
["千分の七","1000/7","ロ　清算人若しくは代表清算人の職務執行の停止若しくはその取消し若しくは変更又は清算人若しくは代表清算人の職務代行者の選任、解任若しくは変更の登記","24/4/ロ","申請件数",6000]
["（これによつて計算した税額が三万円に満たないときは、申請件数一件につき三万円）","（これによつて計算した税額が30000に満たないときは、申請件数30000）","ハ　清算の結了の登記","24/4/ハ","申請件数",2000]
["リ　相互会社の設立（新設合併又は組織変更による設立を含む。）の登記","リ　相互会社の設立（新設合併又は組織変更による設立を含む。）の登記","ニ　登記事項の変更、消滅若しくは廃止の登記（これらの登記のうちロに掲げるものを除く。）、登記の更正の登記又は登記の抹消","24/4/ニ","申請件数",6000]
["申請件数","申請件数","205　特定目的会社の登記","25"]
["一件につき三十万円",300000,"（1）　資産の流動化に関する法律（平成0年法律第百5号）第2条第3項（定義）に規定する特定目的会社（以下この号において「特定目的会社」という。）につきその本店の所在地においてする登記","25/1"]
["ヌ　新株予約権の発行による変更の登記","ヌ　新株予約権の発行による変更の登記","イ　特定目的会社の設立の登記","25/1/イ","申請件数",30000]
["申請件数","申請件数","ロ　イ及びハに掲げる登記以外の登記","25/1/ロ","申請件数",15000]
["一件につき九万円",90000,"ハ　登記の抹消","25/1/ハ","申請件数",10000]
["ル　支店又は従たる事務所の設置の登記","ル　支店又は従たる事務所の設置の登記","（2）　特定目的会社につきその支店の所在地においてする登記","25/2"]
["支店又は従たる事務所の数","支店又は従たる事務所の数","イ　（1）イ及びロに掲げる登記","25/2/イ","申請件数",6000]
["一箇所につき六万円","1箇所につき60000","ロ　登記の抹消","25/2/ロ","申請件数",6000]
["ヲ　本店若しくは主たる事務所又は支店若しくは従たる事務所の移転の登記","ヲ　本店若しくは主たる事務所又は支店若しくは従たる事務所の移転の登記","206　投資法人の登記","26"]
["本店若しくは主たる事務所又は支店若しくは従たる事務所の数","本店若しくは主たる事務所又は支店若しくは従たる事務所の数","（1）　投資信託及び投資法人に関する法律（昭和206年法律第百908号）第2条第02項（定義）に規定する投資法人につきその本店の所在地においてする設立の登記","26/1","申請件数",30000]
["一箇所につき三万円","1箇所につき30000","（2）　（1）及び（3）に掲げる登記以外の登記","26/2","申請件数",15000]
["ワ　取締役会、監査役会、監査等委員会若しくは指名委員会等（会社法第二条第十二号（定義）に規定する指名委員会等をいう。以下（一）において同じ。）又は理事会に関する事項の変更の登記","ワ　取締役会、監査役会、監査等委員会若しくは指名委員会等（会社法第2条第02号（定義）に規定する指名委員会等をいう。以下（1）において同じ。）又は理事会に関する事項の変更の登記","（3）　登記の抹消","26/3","申請件数",10000]
["申請件数","申請件数","207　有限責任事業組合契約の登記","27"]
["一件につき三万円",30000,"（1）　有限責任事業組合契約に関する法律（平成07年法律第40号）第3条第1項（有限責任事業組合契約）に規定する有限責任事業組合契約（以下この号において「組合契約」という。）につきその組合の主たる事務所の所在地においてする登記（（3）に掲げる登記を除く。）","27/1"]
["カ　取締役、代表取締役若しくは特別取締役、会計参与、監査役、会計監査人、指名委員会等の委員、執行役若しくは代表執行役若しくは社員又は理事、監事、代表理事若しくは評議員に関する事項の変更（会社又は相互会社若しくは一般社団法人等の代表に関する事項の変更を含む。）の登記","カ　取締役、代表取締役若しくは特別取締役、会計参与、監査役、会計監査人、指名委員会等の委員、執行役若しくは代表執行役若しくは社員又は理事、監事、代表理事若しくは評議員に関する事項の変更（会社又は相互会社若しくは1般社団法人等の代表に関する事項の変更を含む。）の登記","イ　組合契約の効力の発生の登記","27/1/イ","申請件数",60000]
["申請件数","申請件数","ロ　従たる事務所の設置の登記","27/1/ロ","申請件数",60000]
["一件につき三万円（資本金の額が一億円以下の会社又は一般社団法人等については、一万円）","30000（資本金の額が1億以下の会社又は1般社団法人等については、10000）","ハ　主たる事務所又は従たる事務所の移転の登記","27/1/ハ",null,30000]
["ヨ　支配人の選任の登記又はその代理権の消滅の登記","ヨ　支配人の選任の登記又はその代理権の消滅の登記","ニ　組合員に関する事項の変更の登記","27/1/ニ",null,10000]
["申請件数","申請件数","ホ　組合員の業務執行の停止又は業務代行者の選任の登記","27/1/ホ","申請件数",30000]
["一件につき三万円",30000,"ヘ　イからホまで、ト及びチに掲げる登記以外の登記","27/1/へ","申請件数",30000]
["タ　取締役、代表取締役若しくは特別取締役、会計参与、監査役若しくは指名委員会等の委員、執行役若しくは代表執行役の職務執行の停止若しくは職務代行者の選任、社員の業務執行権の消滅、職務執行の停止若しくは職務代行者の選任又は理事、監事、代表理事若しくは評議員の職務執行の停止若しくは職務代行者の選任の登記","タ　取締役、代表取締役若しくは特別取締役、会計参与、監査役若しくは指名委員会等の委員、執行役若しくは代表執行役の職務執行の停止若しくは職務代行者の選任、社員の業務執行権の消滅、職務執行の停止若しくは職務代行者の選任又は理事、監事、代表理事若しくは評議員の職務執行の停止若しくは職務代行者の選任の登記","ト　登記の更正の登記","27/1/ト","申請件数",20000]
["申請件数","申請件数","チ　登記の抹消","27/1/チ","申請件数",20000]
["一件につき三万円",30000,"（2）　組合契約につきその組合の従たる事務所の所在地においてする登記（（3）に掲げる登記を除く。）","27/2"]
["レ　会社又は相互会社若しくは一般社団法人等の解散の登記","レ　会社又は相互会社若しくは1般社団法人等の解散の登記","イ　（1）イからヘまでに掲げる登記","27/2/イ","申請件数",6000]
["申請件数","申請件数","ロ　登記の更正の登記又は登記の抹消","27/2/ロ","申請件数",6000]
["一件につき三万円",30000,"（3）　組合契約につきその組合の主たる事務所又は従たる事務所の所在地においてする清算に係る登記","27/3"]
["ソ　会社若しくは一般社団法人等の継続の登記、合併を無効とする判決が確定した場合における合併により消滅した会社若しくは相互会社若しくは一般社団法人等の回復の登記又は会社若しくは相互会社若しくは一般社団法人等の設立の無効若しくはその設立の取消しの登記","ソ　会社若しくは1般社団法人等の継続の登記、合併を無効とする判決が確定した場合における合併により消滅した会社若しくは相互会社若しくは1般社団法人等の回復の登記又は会社若しくは相互会社若しくは1般社団法人等の設立の無効若しくはその設立の取消しの登記","イ　清算人の登記","27/3/イ","申請件数",6000]
["申請件数","申請件数","ロ　イ、ハ及びニに掲げる登記以外の登記","27/3/ロ","申請件数",6000]
["一件につき三万円",30000,"ハ　清算結了の登記","27/3/ハ","申請件数",2000]
["ツ　登記事項の変更、消滅又は廃止の登記（これらの登記のうちイからソまでに掲げるものを除く。）","ツ　登記事項の変更、消滅又は廃止の登記（これらの登記のうちイからソまでに掲げるものを除く。）","ニ　登記の更正の登記又は登記の抹消","27/3/ニ","申請件数",6000]
["申請件数","申請件数","208　投資事業有限責任組合契約の登記","28"]
["一件につき三万円",30000,"（1）　投資事業有限責任組合契約に関する法律（平成0年法律第90号）第3条第1項（投資事業有限責任組合契約）に規定する投資事業有限責任組合契約（以下この号において「組合契約」という。）につきその組合の主たる事務所の所在地においてする登記（（3）に掲げる登記を除く。）","28/1"]
["ネ　登記の更正の登記","ネ　登記の更正の登記","イ　組合契約の効力の発生の登記","28/1/イ","申請件数",30000]
["申請件数","申請件数","ロ　イ、ハ及びニに掲げる登記以外の登記","28/1/ロ","申請件数",15000]
["一件につき二万円",20000,"ハ　登記の更正の登記","28/1／ハ","申請件数",10000]
["ナ　登記の抹消","ナ　登記の抹消","ニ　登記の抹消","28/1/二","申請件数",10000]
["申請件数","申請件数","（2）　組合契約につきその組合の従たる事務所の所在地においてする登記（（3）に掲げる登記を除く。）","28/2"]
["一件につき二万円",20000,"イ　（1）イ及びロに掲げる登記","28/2/イ","申請件数",6000]
["（二）　会社又は相互会社若しくは一般社団法人等につきその支店又は従たる事務所の所在地においてする登記（（四）に掲げる登記を除く。）","（2）　会社又は相互会社若しくは1般社団法人等につきその支店又は従たる事務所の所在地においてする登記（（4）に掲げる登記を除く。）","ロ　登記の更正の登記又は登記の抹消","28/2/ロ","申請件数",6000]
["イ　（一）イからツまでに掲げる登記","イ　（1）イからツまでに掲げる登記","（3）　組合契約につきその組合の主たる事務所又は従たる事務所の所在地においてする清算に係る登記","28/3"]
["申請件数","申請件数","イ　清算人の登記","28/3/イ","申請件数",6000]
["一件につき九千円（申請に係る登記が、（一）カに掲げる登記に該当するもののみであり、かつ、資本金の額が一億円以下の会社又は一般社団法人等の申請に係るものである場合には、六千円）","9000（申請に係る登記が、（1）カに掲げる登記に該当するもののみであり、かつ、資本金の額が1億以下の会社又は1般社団法人等の申請に係るものである場合には、6000）","ロ　イ、ハ及びニに掲げる登記以外の登記","28/3/ロ","申請件数",6000]
["ロ　登記の更正の登記又は登記の抹消","ロ　登記の更正の登記又は登記の抹消","ハ　清算結了の登記","28/3/ハ","申請件数",2000]
["申請件数","申請件数","ニ　登記の更正の登記又は登記の抹消","28/3/二","申請件数",6000]
["一件につき六千円",6000,"208の2　限定責任信託の登記","28の２"]
["（三）　外国会社又は外国相互会社につきその営業所の所在地又はその代表者の住所地においてする登記（（四）に掲げる登記を除く。）","（3）　外国会社又は外国相互会社につきその営業所の所在地又はその代表者の住所地においてする登記（（4）に掲げる登記を除く。）","（1）　信託法（平成08年法律第百8号）第2百302条（限定責任信託の定めの登記）の限定責任信託の定めの登記","28の2/1","申請件数",30000]
["イ　営業所の設置の登記（ロに掲げる登記を除く。）","イ　営業所の設置の登記（ロに掲げる登記を除く。）","（2）　信託法第2百303条第1項（変更の登記）の規定による新事務処理地においてする同法第2百302条各号に掲げる事項の登記","28の2/2","申請件数",15000]
["営業所の数","営業所の数","（3）　（1）、（2）及び（4）から（6）までに掲げる登記以外の登記","28の2/3","申請件数",15000]
["一箇所につき九万円","1箇所につき90000","（4）　登記の更正の登記（（6）ニに掲げる登記を除く。）","28の2/4","申請件数",10000]
["ロ　営業所を設置していない場合の外国会社の登記又は当該営業所を設置していない外国会社が初めて設置する一の営業所の設置の登記","ロ　営業所を設置していない場合の外国会社の登記又は当該営業所を設置していない外国会社が初めて設置する1の営業所の設置の登記","（5）　登記の抹消（（6）ニに掲げる登記を除く。）","28の2/5","申請件数",10000]
["申請件数","申請件数","（6）　清算に係る登記","28の2/6"]
["一件につき六万円",60000,"イ　清算受託者の登記","28の2/6/イ","申請件数",6000]
["ハ　イ、ロ及びニに掲げる登記以外の登記","ハ　イ、ロ及びニに掲げる登記以外の登記","ロ　イ、ハ及びニに掲げる登記以外の登記","28の2/6/ロ","申請件数",6000]
["申請件数","申請件数","ハ　清算結了の登記","28の2/6/ハ","申請件数",2000]
["一件につき九千円",9000,"ニ　登記の更正の登記又は登記の抹消","28の2/6/ニ","申請件数",6000]
["ニ　登記の更正の登記又は登記の抹消","ニ　登記の更正の登記又は登記の抹消","209　個人の商業登記","29"]
["申請件数","申請件数","（1）　個人につきその本店の所在地においてする登記","29/1"]
["一件につき六千円",6000,"イ　商号の新設の登記又はその取得による変更の登記","29/1/イ","申請件数",30000]
["（四）　会社又は相互会社若しくは一般社団法人等につきその本店若しくは主たる事務所又は支店若しくは従たる事務所の所在地においてする清算に係る登記（外国会社又は外国相互会社につきその営業所の所在地又はその代表者の住所地においてする清算に係る登記を含む。）","（4）　会社又は相互会社若しくは1般社団法人等につきその本店若しくは主たる事務所又は支店若しくは従たる事務所の所在地においてする清算に係る登記（外国会社又は外国相互会社につきその営業所の所在地又はその代表者の住所地においてする清算に係る登記を含む。）","ロ　支配人の選任又はその代理権の消滅の登記","29/1/ロ","申請件数",30000]
["イ　清算人又は代表清算人の登記","イ　清算人又は代表清算人の登記","ハ　商法（明治302年法律第408号）第5条（未成年者登記）又は第6条第1項（後見人登記）の規定による登記","29/1/ハ","申請件数",18000]
["申請件数","申請件数","ニ　商法第07条第2項（営業譲渡の際の免責の登記）の登記","29/1/ニ","申請件数",18000]
["一件につき九千円",9000,"ホ　商号の廃止の登記又は登記の更正、変更若しくは消滅の登記（これらの登記のうちイ又はロに掲げるものを除く。）","29/1/ホ","申請件数",6000]
["ロ　清算人若しくは代表清算人の職務執行の停止若しくはその取消し若しくは変更又は清算人若しくは代表清算人の職務代行者の選任、解任若しくは変更の登記","ロ　清算人若しくは代表清算人の職務執行の停止若しくはその取消し若しくは変更又は清算人若しくは代表清算人の職務代行者の選任、解任若しくは変更の登記","ヘ　登記の抹消","29/1/へ","申請件数",6000]
["申請件数","申請件数","（2）　個人につきその支店の所在地においてする登記","29/2"]
["一件につき六千円",6000,"イ　（1）イからニまでに掲げる登記","29/2/イ","申請件数",9000]
["ハ　清算の結了の登記","ハ　清算の結了の登記","ロ　（1）ホに掲げる登記又は登記の抹消","29/2/ロ","申請件数",6000]
["申請件数","申請件数","30　船舶管理人の登記","30"]
["一件につき二千円",2000,"（1）　船舶管理人の選任又はその代理権の消滅の登記","30/1","申請件数",30000]
["ニ　登記事項の変更、消滅若しくは廃止の登記（これらの登記のうちロに掲げるものを除く。）、登記の更正の登記又は登記の抹消","ニ　登記事項の変更、消滅若しくは廃止の登記（これらの登記のうちロに掲げるものを除く。）、登記の更正の登記又は登記の抹消","（2）　抹消された登記の回復の登記又は登記事項の更正若しくは変更の登記","30/2","申請件数",6000]
["申請件数","申請件数","301　夫婦財産契約の登記","31"]
["一件につき六千円",6000,"（1）　民法（明治209年法律第809号）第7百506条（夫婦財産契約の対抗要件）の登記","31/1",null,18000]
["二十五　特定目的会社の登記","215　特定目的会社の登記","（2）　登記事項の更正又は変更の登記","31/2","申請件数",6000]
["（一）　資産の流動化に関する法律（平成十年法律第百五号）第二条第三項（定義）に規定する特定目的会社（以下この号において「特定目的会社」という。）につきその本店の所在地においてする登記","（1）　資産の流動化に関する法律（平成0年法律第百5号）第2条第3項（定義）に規定する特定目的会社（以下この号において「特定目的会社」という。）につきその本店の所在地においてする登記","（3）　登記の抹消","31/3","申請件数",6000]
["イ　特定目的会社の設立の登記","イ　特定目的会社の設立の登記"]
["申請件数","申請件数"]
["一件につき三万円",30000]
["ロ　イ及びハに掲げる登記以外の登記","ロ　イ及びハに掲げる登記以外の登記"]
["申請件数","申請件数"]
["一件につき一万五千円",15000]
["ハ　登記の抹消","ハ　登記の抹消"]
["申請件数","申請件数"]
["一件につき一万円",10000]
["（二）　特定目的会社につきその支店の所在地においてする登記","（2）　特定目的会社につきその支店の所在地においてする登記"]
["イ　（一）イ及びロに掲げる登記","イ　（1）イ及びロに掲げる登記"]
["申請件数","申請件数"]
["一件につき六千円",6000]
["ロ　登記の抹消","ロ　登記の抹消"]
["申請件数","申請件数"]
["一件につき六千円",6000]
["二十六　投資法人の登記","206　投資法人の登記"]
["（一）　投資信託及び投資法人に関する法律（昭和二十六年法律第百九十八号）第二条第十二項（定義）に規定する投資法人につきその本店の所在地においてする設立の登記","（1）　投資信託及び投資法人に関する法律（昭和206年法律第百908号）第2条第02項（定義）に規定する投資法人につきその本店の所在地においてする設立の登記"]
["申請件数","申請件数"]
["一件につき三万円",30000]
["（二）　（一）及び（三）に掲げる登記以外の登記","（2）　（1）及び（3）に掲げる登記以外の登記"]
["申請件数","申請件数"]
["一件につき一万五千円",15000]
["（三）　登記の抹消","（3）　登記の抹消"]
["申請件数","申請件数"]
["一件につき一万円",10000]
["二十七　有限責任事業組合契約の登記","207　有限責任事業組合契約の登記"]
["（一）　有限責任事業組合契約に関する法律（平成十七年法律第四十号）第三条第一項（有限責任事業組合契約）に規定する有限責任事業組合契約（以下この号において「組合契約」という。）につきその組合の主たる事務所の所在地においてする登記（（三）に掲げる登記を除く。）","（1）　有限責任事業組合契約に関する法律（平成07年法律第40号）第3条第1項（有限責任事業組合契約）に規定する有限責任事業組合契約（以下この号において「組合契約」という。）につきその組合の主たる事務所の所在地においてする登記（（3）に掲げる登記を除く。）"]
["イ　組合契約の効力の発生の登記","イ　組合契約の効力の発生の登記"]
["申請件数","申請件数"]
["一件につき六万円",60000]
["ロ　従たる事務所の設置の登記","ロ　従たる事務所の設置の登記"]
["申請件数","申請件数"]
["一件につき六万円",60000]
["ハ　主たる事務所又は従たる事務所の移転の登記","ハ　主たる事務所又は従たる事務所の移転の登記"]
["申請件数","申請件数"]
["一件につき三万円",30000]
["ニ　組合員に関する事項の変更の登記","ニ　組合員に関する事項の変更の登記"]
["申請件数","申請件数"]
["一件につき一万円",10000]
["ホ　組合員の業務執行の停止又は業務代行者の選任の登記","ホ　組合員の業務執行の停止又は業務代行者の選任の登記"]
["申請件数","申請件数"]
["一件につき三万円",30000]
["ヘ　イからホまで、ト及びチに掲げる登記以外の登記","ヘ　イからホまで、ト及びチに掲げる登記以外の登記"]
["申請件数","申請件数"]
["一件につき三万円",30000]
["ト　登記の更正の登記","ト　登記の更正の登記"]
["申請件数","申請件数"]
["一件につき二万円",20000]
["チ　登記の抹消","チ　登記の抹消"]
["申請件数","申請件数"]
["一件につき二万円",20000]
["（二）　組合契約につきその組合の従たる事務所の所在地においてする登記（（三）に掲げる登記を除く。）","（2）　組合契約につきその組合の従たる事務所の所在地においてする登記（（3）に掲げる登記を除く。）"]
["イ　（一）イからヘまでに掲げる登記","イ　（1）イからヘまでに掲げる登記"]
["申請件数","申請件数"]
["一件につき六千円",6000]
["ロ　登記の更正の登記又は登記の抹消","ロ　登記の更正の登記又は登記の抹消"]
["申請件数","申請件数"]
["一件につき六千円",6000]
["（三）　組合契約につきその組合の主たる事務所又は従たる事務所の所在地においてする清算に係る登記","（3）　組合契約につきその組合の主たる事務所又は従たる事務所の所在地においてする清算に係る登記"]
["イ　清算人の登記","イ　清算人の登記"]
["申請件数","申請件数"]
["一件につき六千円",6000]
["ロ　イ、ハ及びニに掲げる登記以外の登記","ロ　イ、ハ及びニに掲げる登記以外の登記"]
["申請件数","申請件数"]
["一件につき六千円",6000]
["ハ　清算結了の登記","ハ　清算結了の登記"]
["申請件数","申請件数"]
["一件につき二千円",2000]
["ニ　登記の更正の登記又は登記の抹消","ニ　登記の更正の登記又は登記の抹消"]
["申請件数","申請件数"]
["一件につき六千円",6000]
["二十八　投資事業有限責任組合契約の登記","208　投資事業有限責任組合契約の登記"]
["（一）　投資事業有限責任組合契約に関する法律（平成十年法律第九十号）第三条第一項（投資事業有限責任組合契約）に規定する投資事業有限責任組合契約（以下この号において「組合契約」という。）につきその組合の主たる事務所の所在地においてする登記（（三）に掲げる登記を除く。）","（1）　投資事業有限責任組合契約に関する法律（平成0年法律第90号）第3条第1項（投資事業有限責任組合契約）に規定する投資事業有限責任組合契約（以下この号において「組合契約」という。）につきその組合の主たる事務所の所在地においてする登記（（3）に掲げる登記を除く。）"]
["イ　組合契約の効力の発生の登記","イ　組合契約の効力の発生の登記"]
["申請件数","申請件数"]
["一件につき三万円",30000]
["ロ　イ、ハ及びニに掲げる登記以外の登記","ロ　イ、ハ及びニに掲げる登記以外の登記"]
["申請件数","申請件数"]
["一件につき一万五千円",15000]
["ハ　登記の更正の登記","ハ　登記の更正の登記"]
["申請件数","申請件数"]
["一件につき一万円",10000]
["ニ　登記の抹消","ニ　登記の抹消"]
["申請件数","申請件数"]
["一件につき一万円",10000]
["（二）　組合契約につきその組合の従たる事務所の所在地においてする登記（（三）に掲げる登記を除く。）","（2）　組合契約につきその組合の従たる事務所の所在地においてする登記（（3）に掲げる登記を除く。）"]
["イ　（一）イ及びロに掲げる登記","イ　（1）イ及びロに掲げる登記"]
["申請件数","申請件数"]
["一件につき六千円",6000]
["ロ　登記の更正の登記又は登記の抹消","ロ　登記の更正の登記又は登記の抹消"]
["申請件数","申請件数"]
["一件につき六千円",6000]
["（三）　組合契約につきその組合の主たる事務所又は従たる事務所の所在地においてする清算に係る登記","（3）　組合契約につきその組合の主たる事務所又は従たる事務所の所在地においてする清算に係る登記"]
["イ　清算人の登記","イ　清算人の登記"]
["申請件数","申請件数"]
["一件につき六千円",6000]
["ロ　イ、ハ及びニに掲げる登記以外の登記","ロ　イ、ハ及びニに掲げる登記以外の登記"]
["申請件数","申請件数"]
["一件につき六千円",6000]
["ハ　清算結了の登記","ハ　清算結了の登記"]
["申請件数","申請件数"]
["一件につき二千円",2000]
["ニ　登記の更正の登記又は登記の抹消","ニ　登記の更正の登記又は登記の抹消"]
["申請件数","申請件数"]
["一件につき六千円",6000]
["二十八の二　限定責任信託の登記","208の2　限定責任信託の登記"]
["（一）　信託法（平成十八年法律第百八号）第二百三十二条（限定責任信託の定めの登記）の限定責任信託の定めの登記","（1）　信託法（平成08年法律第百8号）第2百302条（限定責任信託の定めの登記）の限定責任信託の定めの登記"]
["申請件数","申請件数"]
["一件につき三万円",30000]
["（二）　信託法第二百三十三条第一項（変更の登記）の規定による新事務処理地においてする同法第二百三十二条各号に掲げる事項の登記","（2）　信託法第2百303条第1項（変更の登記）の規定による新事務処理地においてする同法第2百302条各号に掲げる事項の登記"]
["申請件数","申請件数"]
["一件につき一万五千円",15000]
["（三）　（一）、（二）及び（四）から（六）までに掲げる登記以外の登記","（3）　（1）、（2）及び（4）から（6）までに掲げる登記以外の登記"]
["申請件数","申請件数"]
["一件につき一万五千円",15000]
["（四）　登記の更正の登記（（六）ニに掲げる登記を除く。）","（4）　登記の更正の登記（（6）ニに掲げる登記を除く。）"]
["申請件数","申請件数"]
["一件につき一万円",10000]
["（五）　登記の抹消（（六）ニに掲げる登記を除く。）","（5）　登記の抹消（（6）ニに掲げる登記を除く。）"]
["申請件数","申請件数"]
["一件につき一万円",10000]
["（六）　清算に係る登記","（6）　清算に係る登記"]
["イ　清算受託者の登記","イ　清算受託者の登記"]
["申請件数","申請件数"]
["一件につき六千円",6000]
["ロ　イ、ハ及びニに掲げる登記以外の登記","ロ　イ、ハ及びニに掲げる登記以外の登記"]
["申請件数","申請件数"]
["一件につき六千円",6000]
["ハ　清算結了の登記","ハ　清算結了の登記"]
["申請件数","申請件数"]
["一件につき二千円",2000]
["ニ　登記の更正の登記又は登記の抹消","ニ　登記の更正の登記又は登記の抹消"]
["申請件数","申請件数"]
["一件につき六千円",6000]
["二十九　個人の商業登記","209　個人の商業登記"]
["（一）　個人につきその本店の所在地においてする登記","（1）　個人につきその本店の所在地においてする登記"]
["イ　商号の新設の登記又はその取得による変更の登記","イ　商号の新設の登記又はその取得による変更の登記"]
["申請件数","申請件数"]
["一件につき三万円",30000]
["ロ　支配人の選任又はその代理権の消滅の登記","ロ　支配人の選任又はその代理権の消滅の登記"]
["申請件数","申請件数"]
["一件につき三万円",30000]
["ハ　商法（明治三十二年法律第四十八号）第五条（未成年者登記）又は第六条第一項（後見人登記）の規定による登記","ハ　商法（明治302年法律第408号）第5条（未成年者登記）又は第6条第1項（後見人登記）の規定による登記"]
["申請件数","申請件数"]
["一件につき一万八千円",18000]
["ニ　商法第十七条第二項（営業譲渡の際の免責の登記）の登記","ニ　商法第07条第2項（営業譲渡の際の免責の登記）の登記"]
["申請件数","申請件数"]
["一件につき一万八千円",18000]
["ホ　商号の廃止の登記又は登記の更正、変更若しくは消滅の登記（これらの登記のうちイ又はロに掲げるものを除く。）","ホ　商号の廃止の登記又は登記の更正、変更若しくは消滅の登記（これらの登記のうちイ又はロに掲げるものを除く。）"]
["申請件数","申請件数"]
["一件につき六千円",6000]
["ヘ　登記の抹消","ヘ　登記の抹消"]
["申請件数","申請件数"]
["一件につき六千円",6000]
["（二）　個人につきその支店の所在地においてする登記","（2）　個人につきその支店の所在地においてする登記"]
["イ　（一）イからニまでに掲げる登記","イ　（1）イからニまでに掲げる登記"]
["申請件数","申請件数"]
["一件につき九千円",9000]
["ロ　（一）ホに掲げる登記又は登記の抹消","ロ　（1）ホに掲げる登記又は登記の抹消"]
["申請件数","申請件数"]
["一件につき六千円",6000]
["三十　船舶管理人の登記","30　船舶管理人の登記"]
["（一）　船舶管理人の選任又はその代理権の消滅の登記","（1）　船舶管理人の選任又はその代理権の消滅の登記"]
["申請件数","申請件数"]
["一件につき三万円",30000]
["（二）　抹消された登記の回復の登記又は登記事項の更正若しくは変更の登記","（2）　抹消された登記の回復の登記又は登記事項の更正若しくは変更の登記"]
["申請件数","申請件数"]
["一件につき六千円",6000]
["三十一　夫婦財産契約の登記","301　夫婦財産契約の登記"]
["（一）　民法（明治二十九年法律第八十九号）第七百五十六条（夫婦財産契約の対抗要件）の登記","（1）　民法（明治209年法律第809号）第7百506条（夫婦財産契約の対抗要件）の登記"]
["申請件数","申請件数"]
["一件につき一万八千円",18000]
["（二）　登記事項の更正又は変更の登記","（2）　登記事項の更正又は変更の登記"]
["申請件数","申請件数"]
["一件につき六千円",6000]
["（三）　登記の抹消","（3）　登記の抹消"]
["申請件数","申請件数"]
["一件につき六千円",6000]